{"text_format":"1","workbook":"xlsx","n_sheets":11,"sheets":["Notice","MINIMES ESTIVAL","BENJAMINS ESTIVAL","MINIMES HIVERNAL","BENJAMINS HIVERNAL","Relais_BE","Relais_MI","engagement jury","verif_reglement","Licenciés","PARAMETRES"],"not_rendered":{"charts":0,"images":10,"macros":1,"external_links":0,"defined_names":4,"comments":0,"pivot_tables":0},"unopened":[],"bounds":{"document_bytes":16777216,"sheet_cells":100000,"rows_first":2000,"rows_last":500,"rows_between":2000,"halvings":0,"cell_chars":16384,"cell_head_chars":4096},"cells_cut":0,"cells_raw":0,"read":"whole","date_system":"1900"}

{"sheet":"Notice","index":0,"n_rows":106,"n_cols":21,"rows_kept":106,"cut":false,"hidden":false,"merged":[[8,17,9,17],[0,0,1,13],[2,17,5,17],[2,19,5,19],[2,20,5,20],[6,17,7,17],[6,19,7,19],[6,20,7,20]]}
["Equip'athlé - Notice d'utilisation du fichier d'engagement"]
[null,null,null,null,null,null,null,null,null,null,null,null,null,null,null,null,null,"Version","Description","Date","Auteur"]
[null,null,null,null,null,null,null,null,null,null,null,null,null,null,null,null,null,"0.1","Amélioration de l'outil fédéral","2022-04-01","CDA31"]
["Présentation des onglets du fichier :",null,null,null,null,null,null,null,null,null,null,null,null,null,null,null,null,null,"Inscription par numéro de licence"]
[null,null,null,null,null,null,null,null,null,null,null,null,null,null,null,null,null,null,"Vérification des engagements sur les triathlons"]
[null,null,null,null,null,null,null,null,null,null,null,null,null,null,null,null,null,null,"Vérification de la contrainte 5 athlètes par épreuve"]
[null,null,null,null,null,null,null,null,null,null,null,null,null,null,null,null,null,"1.0","Ajout de la notice et de l'engagement de plusieurs relais","2022-05-01","CDA31"]
[null,null,null,null,null,null,null,null,null,null,null,null,null,null,null,null,null,null,"Modification de la macro pour l'export logica : création de fichiers txt plutôt qu'enregistrer sous le fichier)"]
[null,null,null,null,null,null,null,null,null,null,null,null,null,null,null,null,null,"1.1","Ajout de la vérification du règlement lorsqu'un athlète fait 2 épreuves","2023-05-01","CDA31"]
[null,null,null,null,null,null,null,null,null,null,null,null,null,null,null,null,null,null,"Ajout de l'onglet \"engagement jury\""]
{"$rows_left_out":97}
{"sheet":"MINIMES ESTIVAL","index":1,"n_rows":70,"n_cols":26,"rows_kept":70,"cut":false,"hidden":false,"merged":[[3,13,3,16],[3,17,3,20],[0,0,0,1],[0,3,0,20],[1,3,1,20],[2,0,3,0],[2,5,2,20],[3,10,3,12],[3,6,3,7],[3,8,3,9]]}
[null,null,null,"Equipe Athlé Automne / Printemps Minime U16"]
["N° club :",null,"Club:",null,null,null,null,null,null,null,null,null,null,null,null,null,null,null,null,null,null,"NIVEAU"]
[null,"Nom","Prénom","Cat","Sexe","Familles"]
[null,null,null,null,null,"Juge","Sprint",null,"Haies",null,"1/2 Fond / Marche",null,null,"Sauts",null,null,null,"Lancers"]
["Licence",null,null,null,null,"Jeune Juge","80m","120m","80 / 100m haies","200m haies","1 000m","2 000m","3 000m Marche","Hauteur","Perche","Longueur","Triple saut","Poids","Disque","Marteau","Javelot","Validité du triathlon","Nombre d'épreuve hors relais","Vérification catégorie MI","Vérification athlète unique","Vérification si 2 épreuves"]
[null,{"$f":"IFERROR(INDEX(Licenciés!B:B,MATCH($A6,Licenciés!$A:$A,0)),\"\")","v":""},{"$f":"IFERROR(INDEX(Licenciés!C:C,MATCH($A6,Licenciés!$A:$A,0)),\"\")","v":""},{"$f":"IFERROR(INDEX(Licenciés!D:D,MATCH($A6,Licenciés!$A:$A,0)),\"\")","v":""},{"$f":"IFERROR(INDEX(Licenciés!E:E,MATCH($A6,Licenciés!$A:$A,0)),\"\")","v":""},null,null,null,null,null,null,null,null,null,null,null,null,null,null,null,null,{"$f":"IF(A6=\"\",\"\",IF(OR(AND(COUNTIF(N6:U6,\"X\")<2,COUNTIF(G6:H6,\"X\")<2,COUNTIF(I6:J6,\"X\")<2,COUNTIF(K6:M6,\"X\")<2,COUNTIF(G6:M6,\"X\")<3),AND(COUNTIF(N6:U6,\"X\")<3,COUNTIF(G6:M6,\"X\")<2))=TRUE,\"OK\",\"NON\"))","v":""},{"$f":"IF(A6=\"\",\"\",COUNTIF(G6:U6,\"X\"))","v":""},{"$f":"IF(D6=\"\",\"\",(IF(D6=\"MI\",\"OK\",\"NON\")))","v":""},{"$f":"IF(A6=\"\",\"\",IF(COUNTIF(A:A,A6)>1,\"athlète inscrit plusieurs fois\",\"OK\"))","v":""},{"$f":"IF(A6=\"\",\"\",IF(W6=2,IF(OR(COUNTIF(I6:J6,\"X\")>1,COUNTIF(K6:M6,\"X\")>1,COUNTIF(G6:H6,\"X\")>1),\"NON\",\"OK\"),\"\"))","v":""}]
[null,{"$f":"IFERROR(INDEX(Licenciés!B:B,MATCH($A7,Licenciés!$A:$A,0)),\"\")","v":""},{"$f":"IFERROR(INDEX(Licenciés!C:C,MATCH($A7,Licenciés!$A:$A,0)),\"\")","v":""},{"$f":"IFERROR(INDEX(Licenciés!D:D,MATCH($A7,Licenciés!$A:$A,0)),\"\")","v":""},{"$f":"IFERROR(INDEX(Licenciés!E:E,MATCH($A7,Licenciés!$A:$A,0)),\"\")","v":""},null,null,null,null,null,null,null,null,null,null,null,null,null,null,null,null,"","","","",""]
[null,{"$f":"IFERROR(INDEX(Licenciés!B:B,MATCH($A8,Licenciés!$A:$A,0)),\"\")","v":""},{"$f":"IFERROR(INDEX(Licenciés!C:C,MATCH($A8,Licenciés!$A:$A,0)),\"\")","v":""},{"$f":"IFERROR(INDEX(Licenciés!D:D,MATCH($A8,Licenciés!$A:$A,0)),\"\")","v":""},{"$f":"IFERROR(INDEX(Licenciés!E:E,MATCH($A8,Licenciés!$A:$A,0)),\"\")","v":""},null,null,null,null,null,null,null,null,null,null,null,null,null,null,null,null,"","","","",""]
[null,{"$f":"IFERROR(INDEX(Licenciés!B:B,MATCH($A9,Licenciés!$A:$A,0)),\"\")","v":""},{"$f":"IFERROR(INDEX(Licenciés!C:C,MATCH($A9,Licenciés!$A:$A,0)),\"\")","v":""},{"$f":"IFERROR(INDEX(Licenciés!D:D,MATCH($A9,Licenciés!$A:$A,0)),\"\")","v":""},{"$f":"IFERROR(INDEX(Licenciés!E:E,MATCH($A9,Licenciés!$A:$A,0)),\"\")","v":""},null,null,null,null,null,null,null,null,null,null,null,null,null,null,null,null,"","","","",""]
[null,{"$f":"IFERROR(INDEX(Licenciés!B:B,MATCH($A10,Licenciés!$A:$A,0)),\"\")","v":""},{"$f":"IFERROR(INDEX(Licenciés!C:C,MATCH($A10,Licenciés!$A:$A,0)),\"\")","v":""},{"$f":"IFERROR(INDEX(Licenciés!D:D,MATCH($A10,Licenciés!$A:$A,0)),\"\")","v":""},{"$f":"IFERROR(INDEX(Licenciés!E:E,MATCH($A10,Licenciés!$A:$A,0)),\"\")","v":""},null,null,null,null,null,null,null,null,null,null,null,null,null,null,null,null,"","","","",""]
{"$rows_left_out":61}
{"sheet":"BENJAMINS ESTIVAL","index":2,"n_rows":70,"n_cols":23,"rows_kept":70,"cut":false,"hidden":false,"merged":[[0,0,0,1],[0,3,0,17],[1,3,1,17],[2,5,2,17],[3,6,3,9],[3,10,3,13],[3,14,3,17]]}
[null,null,null,"Equipe Athlé Automne / Printemps Benjamins U14"]
["N° club :",null,"Club:",null,null,null,null,null,null,null,null,null,null,null,null,null,null,null,"NIVEAU"]
[null,"Nom","Prénom","Cat","Sexe","Familles"]
[null,null,null,null,null,"Juge","Courses",null,null,null,"Sauts",null,null,null,"Lancers"]
["Licence",null,null,null,null,"Jeune Juge","50m","50m haies","1000m","2 000m Marche","Hauteur","Perche","Longueur","Triple saut","Poids","Disque","Marteau","Javelot","Validité du triathlon","Nombre d'épreuve hors relais","Vérification catégorie BE","Vérification athlète unique","Vérification si 2 épreuves"]
[null,{"$f":"IFERROR(INDEX(Licenciés!B:B,MATCH($A6,Licenciés!$A:$A,0)),\"\")","v":""},{"$f":"IFERROR(INDEX(Licenciés!C:C,MATCH($A6,Licenciés!$A:$A,0)),\"\")","v":""},{"$f":"IFERROR(INDEX(Licenciés!D:D,MATCH($A6,Licenciés!$A:$A,0)),\"\")","v":""},{"$f":"IFERROR(INDEX(Licenciés!E:E,MATCH($A6,Licenciés!$A:$A,0)),\"\")","v":""},null,null,null,null,null,null,null,null,null,null,null,null,null,{"$f":"IF(A6=\"\",\"\",IF(T6=3,IF(AND(COUNTIF(G6:J6,\"X\")<2,COUNTIF(K6:N6,\"X\")<2,COUNTIF(O6:R6,\"X\")<2)=TRUE,\"OK\",\"NON\"),IF(T6>3,\"NON\",\"\")))","v":""},{"$f":"IF(A6=\"\",\"\",COUNTIF(G6:R6,\"X\"))","v":""},{"$f":"IF(D6=\"\",\"\",IF(D6=\"BE\",\"OK\",\"NON\"))","v":""},{"$f":"IF(A6=\"\",\"\",IF(COUNTIF(A:A,A6)>1,\"athlète inscrit plusieurs fois\",\"OK\"))","v":""},{"$f":"IF(T6=2,IF(OR(AND(COUNTIF(G6:J6,\"X\")=1,COUNTIF(K6:R6,\"X\")=1),AND(COUNTIF(G6:J6,\"X\")=0,COUNTIF(K6:N6,\"X\")=1,COUNTIF(O6:R6,\"X\")=1)),\"OK\",\"NON\"),\"\")","v":""}]
[null,{"$f":"IFERROR(INDEX(Licenciés!B:B,MATCH($A7,Licenciés!$A:$A,0)),\"\")","v":""},{"$f":"IFERROR(INDEX(Licenciés!C:C,MATCH($A7,Licenciés!$A:$A,0)),\"\")","v":""},{"$f":"IFERROR(INDEX(Licenciés!D:D,MATCH($A7,Licenciés!$A:$A,0)),\"\")","v":""},{"$f":"IFERROR(INDEX(Licenciés!E:E,MATCH($A7,Licenciés!$A:$A,0)),\"\")","v":""},null,null,null,null,null,null,null,null,null,null,null,null,null,{"$f":"IF(A7=\"\",\"\",IF(AND(COUNTIF(G7:J7,\"X\")<2,COUNTIF(K7:N7,\"X\")<2,COUNTIF(O7:R7,\"X\")<2)=TRUE,\"OK\",\"NON\"))","v":""},"","","",""]
[null,{"$f":"IFERROR(INDEX(Licenciés!B:B,MATCH($A8,Licenciés!$A:$A,0)),\"\")","v":""},{"$f":"IFERROR(INDEX(Licenciés!C:C,MATCH($A8,Licenciés!$A:$A,0)),\"\")","v":""},{"$f":"IFERROR(INDEX(Licenciés!D:D,MATCH($A8,Licenciés!$A:$A,0)),\"\")","v":""},{"$f":"IFERROR(INDEX(Licenciés!E:E,MATCH($A8,Licenciés!$A:$A,0)),\"\")","v":""},null,null,null,null,null,null,null,null,null,null,null,null,null,"","","","",""]
[null,{"$f":"IFERROR(INDEX(Licenciés!B:B,MATCH($A9,Licenciés!$A:$A,0)),\"\")","v":""},{"$f":"IFERROR(INDEX(Licenciés!C:C,MATCH($A9,Licenciés!$A:$A,0)),\"\")","v":""},{"$f":"IFERROR(INDEX(Licenciés!D:D,MATCH($A9,Licenciés!$A:$A,0)),\"\")","v":""},{"$f":"IFERROR(INDEX(Licenciés!E:E,MATCH($A9,Licenciés!$A:$A,0)),\"\")","v":""},null,null,null,null,null,null,null,null,null,null,null,null,null,"","","","",""]
[null,{"$f":"IFERROR(INDEX(Licenciés!B:B,MATCH($A10,Licenciés!$A:$A,0)),\"\")","v":""},{"$f":"IFERROR(INDEX(Licenciés!C:C,MATCH($A10,Licenciés!$A:$A,0)),\"\")","v":""},{"$f":"IFERROR(INDEX(Licenciés!D:D,MATCH($A10,Licenciés!$A:$A,0)),\"\")","v":""},{"$f":"IFERROR(INDEX(Licenciés!E:E,MATCH($A10,Licenciés!$A:$A,0)),\"\")","v":""},null,null,null,null,null,null,null,null,null,null,null,null,null,"","","","",""]
{"$rows_left_out":61}
{"sheet":"MINIMES HIVERNAL","index":3,"n_rows":5,"n_cols":14,"rows_kept":5,"cut":false,"hidden":true,"merged":[[0,0,0,1],[0,3,0,13],[1,3,1,13],[2,5,2,13],[3,6,3,9],[3,10,3,13]]}
[null,null,null,"Equipe Athlé Hivernal Minime U16"]
["N° club :","moi","Club:"]
[null,"Nom","Prénom","Cat","Sexe","Familles"]
[null,null,null,null,null,"Juge","Course et Lancers",null,null,null,"Sauts"]
["Licence",null,null,null,null,"Jeune Juge","50m Salle","50m haies Salle","3 000m Marche Salle","Poids Salle","Hauteur Salle","Perche Salle","Longueur Salle","Triple saut Salle"]

{"sheet":"BENJAMINS HIVERNAL","index":4,"n_rows":5,"n_cols":14,"rows_kept":5,"cut":false,"hidden":true,"merged":[[2,5,2,13],[3,6,3,9],[3,10,3,13],[0,0,0,1],[0,3,0,13],[1,3,1,13],[2,1,4,1],[2,2,4,2],[2,3,4,3],[2,4,4,4]]}
[null,null,null,"Equipe Athlé Hivernal Benjamins U14"]
["N° club :",null,"Club:"]
[null,"Nom","Prénom","Cat","Sexe","Familles"]
[null,null,null,null,null,"Juge","Course et Lancers",null,null,null,"Sauts"]
["Licence",null,null,null,null,"Jeune Juge","50m Salle","50m haies Salle","2 000m Marche Salle","Poids Salle","Hauteur Salle","Perche Salle","Longueur Salle","Triple saut Salle"]

{"sheet":"Relais_BE","index":5,"n_rows":49,"n_cols":12,"rows_kept":49,"cut":false,"hidden":false,"merged":[[33,0,36,0],[37,0,40,0],[41,0,44,0],[45,0,48,0],[6,2,8,2],[9,0,12,0],[13,0,16,0],[17,0,20,0],[21,0,24,0],[25,0,28,0],[29,0,32,0],[9,10,12,10],[13,10,16,10],[17,10,20,10],[21,10,24,10],[25,10,28,10],[29,10,32,10],[33,10,36,10],[37,10,40,10],[41,10,44,10],[45,10,48,10],[6,7,8,7],[6,8,8,8],[0,2,0,11],[2,1,4,10],[6,3,8,3],[6,4,8,4],[6,5,8,5],[6,6,8,6],[6,11,8,11],[6,9,8,9],[6,10,8,10]]}
[null,null,"Equipe Athlé Automne / Printemps U16"]
[]
[null,"Benjamins U14"]
[]
[]
[]
[null,null,"Nom","Prénom","Cat","Sexe","nom club","nom equipe","ordre de relais","Vérif catégorie athlète","Vérif relais mixte","Vérif athlète dans un seul relais"]
[]
[null,"Licence"]
["BE 1",null,{"$f":"IFERROR(INDEX(Licenciés!B:B,MATCH($B10,Licenciés!$A:$A,0)),\"\")","v":""},{"$f":"IFERROR(INDEX(Licenciés!C:C,MATCH($B10,Licenciés!$A:$A,0)),\"\")","v":""},{"$f":"IFERROR(INDEX(Licenciés!D:D,MATCH($B10,Licenciés!$A:$A,0)),\"\")","v":""},{"$f":"IFERROR(INDEX(Licenciés!E:E,MATCH($B10,Licenciés!$A:$A,0)),\"\")","v":""},{"$f":"'BENJAMINS ESTIVAL'!$D$2&\" \"&'BENJAMINS ESTIVAL'!$T$2","v":" "},{"$f":"G10&\" \"&A10","v":"  BE 1"},1,{"$f":"IF(B10=\"\",\"\",IF(E10=\"BE\",\"OK\",\"NON\"))","v":""},{"$f":"IF(B10=\"\",\"\",IF(AND(OR(COUNTIF(E10:E13,\"BE\")=4,COUNTIF(E10:E13,\"MI\")=4),COUNTIF(F10:F13,\"F\")=2,COUNTIF(F10:F13,\"M\")=2),\"Mixte\",\"NON\"))","v":""},{"$f":"IF(B10=\"\",\"\",IF(COUNTIF(B:B,B10)>1,\"athlète dans plusieurs relais\",\"OK\"))","v":""}]
{"$rows_left_out":40}
{"sheet":"Relais_MI","index":6,"n_rows":49,"n_cols":12,"rows_kept":49,"cut":false,"hidden":false,"merged":[[33,0,36,0],[37,0,40,0],[41,0,44,0],[45,0,48,0],[6,2,8,2],[9,0,12,0],[13,0,16,0],[17,0,20,0],[21,0,24,0],[25,0,28,0],[29,0,32,0],[9,10,12,10],[13,10,16,10],[17,10,20,10],[21,10,24,10],[25,10,28,10],[29,10,32,10],[33,10,36,10],[37,10,40,10],[41,10,44,10],[45,10,48,10],[6,7,8,7],[6,8,8,8],[0,2,0,11],[2,1,4,10],[6,3,8,3],[6,4,8,4],[6,5,8,5],[6,6,8,6],[6,11,8,11],[6,9,8,9],[6,10,8,10]]}
[null,null,"Equipe Athlé Automne / Printemps U16"]
[]
[null,"Minimes U16"]
[]
[]
[]
[null,null,"Nom","Prénom","Cat","Sexe","nom club","nom equipe","ordre de relais","Vérif catégorie athlète","Vérif relais mixte","Vérif athlète dans un seul relais"]
[]
[null,"Licence"]
["MI 1",null,{"$f":"IFERROR(INDEX(Licenciés!B:B,MATCH($B10,Licenciés!$A:$A,0)),\"\")","v":""},{"$f":"IFERROR(INDEX(Licenciés!C:C,MATCH($B10,Licenciés!$A:$A,0)),\"\")","v":""},{"$f":"IFERROR(INDEX(Licenciés!D:D,MATCH($B10,Licenciés!$A:$A,0)),\"\")","v":""},{"$f":"IFERROR(INDEX(Licenciés!E:E,MATCH($B10,Licenciés!$A:$A,0)),\"\")","v":""},{"$f":"'MINIMES ESTIVAL'!$D$2&\" \"&'MINIMES ESTIVAL'!$W$2","v":" "},{"$f":"G10&\" \"&A10","v":"  MI 1"},1,{"$f":"IF(B10=\"\",\"\",IF(E10=\"MI\",\"OK\",\"NON\"))","v":""},{"$f":"IF(B10=\"\",\"\",IF(AND(OR(COUNTIF(E10:E13,\"BE\")=4,COUNTIF(E10:E13,\"MI\")=4),COUNTIF(F10:F13,\"F\")=2,COUNTIF(F10:F13,\"M\")=2),\"Mixte\",\"NON\"))","v":""},{"$f":"IF(B10=\"\",\"\",IF(COUNTIF(B:B,B10)>1,\"athlète dans plusieurs relais\",\"OK\"))","v":""}]
{"$rows_left_out":40}
{"sheet":"engagement jury","index":7,"n_rows":1,"n_cols":4,"rows_kept":1,"cut":false,"hidden":false,"merged":[]}
["Licence","Nom","Prenom","Fonction, concours souhaité"]

{"sheet":"verif_reglement","index":8,"n_rows":21,"n_cols":8,"rows_kept":21,"cut":false,"hidden":false,"merged":[[1,1,1,7],[3,2,3,3],[3,6,3,7]]}
[]
[null,"Rappel règlement : 5 athlètes maximum par épreuve et par sexe\nLes tableaux ci-dessous montrent le nombre d'athlètes inscrits sur une même épreuve par catégorie et par sexe. \nLes anomalies sont détectées en rouge"]
[]
[null,null,"nombre d'engagés par épreuve (max 5 par sexe)",null,null,null,"nombre d'engagés par épreuve (max 5 par sexe)"]
[null,null,"MI","MI",null,null,"BE","BE"]
[null,null,"F","M",null,null,"F","M"]
[null,"80m",{"$f":"COUNTIFS('MINIMES ESTIVAL'!G$6:G$130,\"X\",'MINIMES ESTIVAL'!$D$6:$D$130,verif_reglement!C$5,'MINIMES ESTIVAL'!$E$6:$E$130,verif_reglement!C$6)","v":0},{"$f":"COUNTIFS('MINIMES ESTIVAL'!G$6:G$130,\"X\",'MINIMES ESTIVAL'!$D$6:$D$130,verif_reglement!D$5,'MINIMES ESTIVAL'!$E$6:$E$130,verif_reglement!D$6)","v":0},null,"50m",{"$f":"COUNTIFS('BENJAMINS ESTIVAL'!G$6:G$130,\"X\",'BENJAMINS ESTIVAL'!$D$6:$D$130,verif_reglement!G$5,'BENJAMINS ESTIVAL'!$E$6:$E$130,verif_reglement!G$6)","v":0},{"$f":"COUNTIFS('BENJAMINS ESTIVAL'!G$6:G$130,\"X\",'BENJAMINS ESTIVAL'!$D$6:$D$130,verif_reglement!H$5,'BENJAMINS ESTIVAL'!$E$6:$E$130,verif_reglement!H$6)","v":0}]
[null,"120m",{"$f":"COUNTIFS('MINIMES ESTIVAL'!H$6:H$130,\"X\",'MINIMES ESTIVAL'!$D$6:$D$130,verif_reglement!C$5,'MINIMES ESTIVAL'!$E$6:$E$130,verif_reglement!C$6)","v":0},{"$f":"COUNTIFS('MINIMES ESTIVAL'!H$6:H$130,\"X\",'MINIMES ESTIVAL'!$D$6:$D$130,verif_reglement!D$5,'MINIMES ESTIVAL'!$E$6:$E$130,verif_reglement!D$6)","v":0},null,"50m haies",{"$f":"COUNTIFS('BENJAMINS ESTIVAL'!H$6:H$130,\"X\",'BENJAMINS ESTIVAL'!$D$6:$D$130,verif_reglement!G$5,'BENJAMINS ESTIVAL'!$E$6:$E$130,verif_reglement!G$6)","v":0},{"$f":"COUNTIFS('BENJAMINS ESTIVAL'!H$6:H$130,\"X\",'BENJAMINS ESTIVAL'!$D$6:$D$130,verif_reglement!H$5,'BENJAMINS ESTIVAL'!$E$6:$E$130,verif_reglement!H$6)","v":0}]
[null,"80 / 100m haies",{"$f":"COUNTIFS('MINIMES ESTIVAL'!I$6:I$130,\"X\",'MINIMES ESTIVAL'!$D$6:$D$130,verif_reglement!C$5,'MINIMES ESTIVAL'!$E$6:$E$130,verif_reglement!C$6)","v":0},{"$f":"COUNTIFS('MINIMES ESTIVAL'!I$6:I$130,\"X\",'MINIMES ESTIVAL'!$D$6:$D$130,verif_reglement!D$5,'MINIMES ESTIVAL'!$E$6:$E$130,verif_reglement!D$6)","v":0},null,"1000m",{"$f":"COUNTIFS('BENJAMINS ESTIVAL'!I$6:I$130,\"X\",'BENJAMINS ESTIVAL'!$D$6:$D$130,verif_reglement!G$5,'BENJAMINS ESTIVAL'!$E$6:$E$130,verif_reglement!G$6)","v":0},{"$f":"COUNTIFS('BENJAMINS ESTIVAL'!I$6:I$130,\"X\",'BENJAMINS ESTIVAL'!$D$6:$D$130,verif_reglement!H$5,'BENJAMINS ESTIVAL'!$E$6:$E$130,verif_reglement!H$6)","v":0}]
[null,"200m haies",{"$f":"COUNTIFS('MINIMES ESTIVAL'!J$6:J$130,\"X\",'MINIMES ESTIVAL'!$D$6:$D$130,verif_reglement!C$5,'MINIMES ESTIVAL'!$E$6:$E$130,verif_reglement!C$6)","v":0},{"$f":"COUNTIFS('MINIMES ESTIVAL'!J$6:J$130,\"X\",'MINIMES ESTIVAL'!$D$6:$D$130,verif_reglement!D$5,'MINIMES ESTIVAL'!$E$6:$E$130,verif_reglement!D$6)","v":0},null,"2 000m Marche",{"$f":"COUNTIFS('BENJAMINS ESTIVAL'!J$6:J$130,\"X\",'BENJAMINS ESTIVAL'!$D$6:$D$130,verif_reglement!G$5,'BENJAMINS ESTIVAL'!$E$6:$E$130,verif_reglement!G$6)","v":0},{"$f":"COUNTIFS('BENJAMINS ESTIVAL'!J$6:J$130,\"X\",'BENJAMINS ESTIVAL'!$D$6:$D$130,verif_reglement!H$5,'BENJAMINS ESTIVAL'!$E$6:$E$130,verif_reglement!H$6)","v":0}]
{"$rows_left_out":12}
{"sheet":"Licenciés","index":9,"n_rows":3654,"n_cols":9,"rows_kept":3654,"cut":false,"hidden":true,"merged":[]}
["Licence","NOM","PRENOM","Cat.","S.","Club","Code club",null,"Listing au 14/05/2024"]
[1289998,"JOBARD","EMILIEN","MI","M","011001","011001","COMP"]
[1466530,"GIL","PAULINE","MI","F","066003","066003","COMP"]
[1488945,"DIAZ","LOUNA","MI","F","082014","082014","COMP"]
[1488960,"DIAITE","AMINATA","MI","F","082014","082014","COMP"]
[1565562,"RICHARD","NOE","MI","M","046008","046008","COMP"]
[1651027,"LAZZAROTTO","ALICIA","MI","F","034038","034038","COMP"]
[1651512,"BEN-BAHOU","NORAINE","MI","M","031004","031004","COMP"]
[1651974,"GRAUGNARD","ISAURE","MI","F","031056","031056","COMP"]
[1655786,"FROMENTEAU","GABRIEL","MI","M","081048","081048","COMP"]
{"$rows_left_out":3645}
{"sheet":"PARAMETRES","index":10,"n_rows":16,"n_cols":16,"rows_kept":16,"cut":false,"hidden":true,"merged":[]}
["Epreuve F","LOGICA","Epreuve M","LOGICA","Epreuve F","LOGICA","Epreuve M","LOGICA","Epreuve F","LOGICA","Epreuve M","LOGICA","Epreuve F","LOGICA","Epreuve M","LOGICA"]
["80m",108,"80m",108,"50m",104,"50m",104,"50m Salle",105,"50m Salle",105,"50m Salle",105,"50m Salle",105]
["120m",112,"120m",112,"50m haies",321,"50m haies",321,"50m haies  Salle",301,"50m haies Salle",302,"50m haies Salle",301,"50m haies Salle",302]
["80m haies",308,"100m haies",310,"1000m",210,"1000m",210,"3000m marche Salle",953,"3000m marche Salle",953,"2000m marche Salle",952,"2000m marche Salle",952]
["200m haies",326,"200m haies",326,"2000m marche",902,"2000m marche",902,"Poids (3 kg)  Salle",653,"Poids (4 kg) Salle",654,"Poids (2 kg) Salle",652,"Poids (3 kg) Salle",653]
["1000m",210,"1000m",210,"Hauteur",501,"Hauteur",501,"Hauteur Salle",511,"Hauteur Salle",511,"Hauteur Salle",511,"Hauteur Salle",511]
["2000m",220,"2000m",220,"Perche",502,"Perche",502,"Perche Salle",522,"Perche Salle",522,"Perche Salle",522,"Perche Salle",522]
["3000m marche",903,"3000m marche",903,"Longueur",503,"Longueur",503,"Longueur Salle",513,"Longueur Salle",513,"Longueur Salle",513,"Longueur Salle",513]
["Hauteur",501,"Hauteur",501,"Triple saut",504,"Triple saut",504,"Triple saut Salle",514,"Triple saut Salle",514,"Triple saut Salle",514,"Triple saut Salle",514]
["Perche",502,"Perche",502,"Poids (2 kg)",602,"Poids (3 kg)",603]
{"$rows_left_out":6}